{"text_format":"1","workbook":"xlsx","n_sheets":2,"sheets":["文面","宛先"],"not_rendered":{"charts":0,"images":0,"macros":1,"external_links":0,"defined_names":0,"comments":0,"pivot_tables":0},"unopened":[],"bounds":{"document_bytes":16777216,"sheet_cells":100000,"rows_first":2000,"rows_last":500,"rows_between":2000,"halvings":0,"cell_chars":16384,"cell_head_chars":4096},"cells_cut":0,"cells_raw":0,"read":"whole","date_system":"1900"}

{"sheet":"文面","index":0,"n_rows":32,"n_cols":58,"rows_kept":32,"cut":false,"hidden":false,"merged":[[23,3,23,48],[24,3,24,48],[25,3,25,48],[26,3,26,48],[2,1,2,33],[3,1,3,33],[4,1,4,33],[5,1,5,33],[6,1,6,33],[11,1,12,50],[14,1,21,50],[22,3,22,48],[27,3,27,48],[28,3,28,48],[29,3,29,48],[30,3,30,48],[31,3,31,48]]}
[null,null,null,null,null,null,null,null,null,null,null,null,null,null,null,null,null,null,null,null,null,null,null,null,null,null,null,null,null,null,null,null,null,null,null,null,null,null,null,null,null,null,null,null,null,null,null,null,null,null,null,null,null,null,null,"番号",null,"処理選択"]
[null,null,null,null,null,null,null,null,null,null,null,null,null,null,null,null,null,null,null,null,null,null,null,null,null,null,null,null,null,null,null,null,null,null,null,null,null,null,null,null,null,null,null,null,null,null,null,null,null,null,null,null,null,null,null,1,null,"印刷プレビュー"]
[null,{"$f":"IFERROR(IF(INDEX(宛先!$F$3:$F$101,MATCH($BD$2,宛先!$B$3:$B$101))=\"\",\"\",\"〒\"&INDEX(宛先!$F$3:$F$101,MATCH($BD$2,宛先!$B$3:$B$101))),\"\")","v":"〒123-4567"}]
[null,{"$f":"IFERROR(IF(INDEX(宛先!$G$3:$G$101,MATCH($BD$2,宛先!$B$3:$B$101))=\"\",\"\",INDEX(宛先!$G$3:$G$101,MATCH($BD$2,宛先!$B$3:$B$101))),\"\")","v":"東京都○○区○○○○○1234"}]
[null,{"$f":"IFERROR(IF(INDEX(宛先!$H$3:$H$101,MATCH($BD$2,宛先!$B$3:$B$101))=\"\",\"\",INDEX(宛先!$H$3:$H$101,MATCH($BD$2,宛先!$B$3:$B$101))),\"\")","v":""}]
[null,{"$f":"IFERROR(IF(INDEX(宛先!$D$3:$D$101,MATCH($BD$2,宛先!$B$3:$B$101))=\"\",\"\",INDEX(宛先!$D$3:$D$101,MATCH($BD$2,宛先!$B$3:$B$101))),\"\")","v":"AAA"}]
[null,{"$f":"IFERROR(IF(INDEX(宛先!$E$3:$E$101,MATCH($BD$2,宛先!$B$3:$B$101))=\"\",\"\",INDEX(宛先!$E$3:$E$101,MATCH($BD$2,宛先!$B$3:$B$101))&\"　様\"),\"\")","v":"代表　あいうえお　様"}]
[]
[]
[]
[]
[null,"◯◯◯◯のお知らせ"]
[]
[]
[null,"　拝啓、時下ますますご清栄のこととお喜び申し上げます。\n　平素は格別のお引き立てを賜り、誠にありがとうございます。\n\n　さて、このたび弊社では、下記のとおり…することになりましたので、お知らせ申し上げます。\n　つきましては、…\n　なお、…。"]
[]
[]
[]
[]
[]
[]
[]
[null,null,null,"記"]
[]
[null,null,null,"1　○○○○について"]
[]
[null,null,null,"2　△△△について"]
[]
[null,null,null,"3　◇◇◇◇について"]
[]
[]
[null,null,null,"以上　"]

{"sheet":"宛先","index":1,"n_rows":101,"n_cols":8,"rows_kept":101,"cut":false,"hidden":false,"merged":[]}
[null,"宛先登録"]
[null,"№","処理","組織名","氏名","郵便番号","住所１","住所２"]
[null,1,{"$f":"IF(COUNTA($D3:$H3)=0,\"\",\"○\")","v":"○"},"AAA","代表　あいうえお","123-4567","東京都○○区○○○○○1234"]
[null,2,{"$f":"IF(COUNTA($D4:$H4)=0,\"\",\"○\")","v":"○"},"BBBB","会長　かきくけこ","123-4568","北海道○○市○○○1235"]
[null,3,"○","CCCCCC","さしすせそ","123-4569","大阪府○○市○○○○○1236","○○ハイツ１０１"]
[null,4,"○","DDDD","たちつてと","123-4570","京都府○○市○○○○1237","○○マンション２０２"]
[null,5,"○","EEEEE","なにぬねの","123-4571","埼玉県○○市○○1238","○○コーポ３０３"]
[null,6,""]
[null,7,""]
[null,8,""]
[null,9,""]
[null,10,""]
[null,11,""]
[null,12,""]
[null,13,""]
[null,14,""]
[null,15,""]
[null,16,""]
[null,17,""]
[null,18,""]
[null,19,""]
[null,20,""]
[null,21,""]
[null,22,""]
[null,23,""]
[null,24,""]
[null,25,""]
[null,26,""]
[null,27,""]
[null,28,""]
[null,29,""]
[null,30,""]
[null,31,""]
[null,32,""]
[null,33,""]
[null,34,""]
[null,35,""]
[null,36,""]
[null,37,""]
[null,38,""]
[null,39,""]
[null,40,""]
[null,41,""]
[null,42,""]
[null,43,""]
[null,44,""]
[null,45,""]
[null,46,""]
[null,47,""]
[null,48,""]
[null,49,""]
[null,50,""]
[null,51,""]
[null,52,""]
[null,53,""]
[null,54,""]
[null,55,""]
[null,56,""]
[null,57,""]
[null,58,""]
[null,59,""]
[null,60,""]
[null,61,""]
[null,62,""]
[null,63,""]
[null,64,""]
[null,65,""]
[null,66,{"$f":"IF(COUNTA($D68:$H68)=0,\"\",\"○\")","v":""}]
[null,67,""]
[null,68,""]
[null,69,""]
[null,70,""]
[null,71,""]
[null,72,""]
[null,73,""]
[null,74,""]
[null,75,""]
[null,76,""]
[null,77,""]
[null,78,""]
[null,79,""]
[null,80,""]
[null,81,""]
[null,82,""]
[null,83,""]
[null,84,""]
[null,85,""]
[null,86,""]
[null,87,""]
[null,88,""]
[null,89,""]
[null,90,""]
[null,91,""]
[null,92,""]
[null,93,""]
[null,94,""]
[null,95,""]
[null,96,""]
[null,97,""]
[null,98,""]
[null,99,""]